Reaction Details
TargetRibosomal protein S6 kinase alpha-3
LigandBDBM286089
Substrate/Competitorn/a
Meas. Tech.Radioisotope assay
IC50 23000±n/a nM
Citation Dunn, SEJayanthan, ANagireddy, JRAnnedi, SVan Drie, JHDaynard, TSHuynh, M Substituted tetrahydropyrido[3′,2′:4,5]pyrrolo[1,2-α]pyrazine-2-carboxamides as RSK inhibitors US Patent US10081632 Publication Date 9/25/2018
 
Ribosomal protein S6 kinase alpha-3
Name:Ribosomal protein S6 kinase alpha-3
Type:Serine/threonine-protein kinase
Mol. Mass.:83740.03
Organism:Homo sapiens (Human)
Description:The human RSK2 sequence differed from the Genbank entry NM_004586 at one residue, V45G. The protein was cloned and purified from baculovirus expression system.
Residue:740
BDBM286089
NameBDBM286089
Synonyms:(R)¿N-(1-(3-aminobenzyl)-1H-pyrazol-4-yl)-9-methyl-6-oxo-6,7,8,9-tetrahydropyrido[3′,2′:4,5]pyrrolo[1,2-a]pyrazine-2-carboxamide US10081632, Compound 16 | US10758530, Compound 16
TypeSmall organic molecule
Emp. Form.C22H21N7O2
Mol. Mass.415.4478
SMILESC[C@@H]1CNC(=O)c2cc3ccc(nc3n12)C(=O)Nc1cnn(Cc2cccc(N)c2)c1