Reaction Details
TargetcAMP and cAMP-inhibited cGMP 3',5'-cyclic phosphodiesterase 10A
LigandBDBM147136
Substrate/Competitorn/a
Meas. Tech.Inhibition Assay
Ki 0.012±n/a nM
Citation Cox, CDRaheem, ITSchreier, JD Pyrazolopyrimidine PDE 10 inhibitors US Patent US8957077 Publication Date 2/17/2015
 
cAMP and cAMP-inhibited cGMP 3',5'-cyclic phosphodiesterase 10A
Name:cAMP and cAMP-inhibited cGMP 3',5'-cyclic phosphodiesterase 10A
Type:Protein
Mol. Mass.:88412.52
Organism:Homo sapiens (Human)
Description:Q9Y233
Residue:1055
BDBM147136
NameBDBM147136
Synonyms:US8957077, M-3
TypeSmall organic molecule
Emp. Form.C20H21N7O2S
Mol. Mass.423.491
SMILESCOc1ccc(nc1)[C@H]1C[C@@H]1COc1cc(NCc2nnc(C)s2)n2nccc2n1