Reaction Details
TargetcAMP and cAMP-inhibited cGMP 3',5'-cyclic phosphodiesterase 10A
LigandBDBM147143
Substrate/Competitorn/a
Meas. Tech.Inhibition Assay
Ki 0.08±n/a nM
Citation Cox, CDRaheem, ITSchreier, JD Pyrazolopyrimidine PDE 10 inhibitors US Patent US8957077 Publication Date 2/17/2015
 
cAMP and cAMP-inhibited cGMP 3',5'-cyclic phosphodiesterase 10A
Name:cAMP and cAMP-inhibited cGMP 3',5'-cyclic phosphodiesterase 10A
Type:Protein
Mol. Mass.:88412.52
Organism:Homo sapiens (Human)
Description:Q9Y233
Residue:779
BDBM147143
NameBDBM147143
Synonyms:US8957077, 1-18
TypeSmall organic molecule
Emp. Form.C19H18FN7OS
Mol. Mass.411.456
SMILESCc1nnc(CNc2c(F)c(OC[C@H]3C[C@@H]3c3ccccn3)nc3ccnn23)s1