Reaction Details
TargetTyrosine-protein kinase JAK1
LigandBDBM286095
Substrate/Competitorn/a
Meas. Tech.In Vitro JAK Kinase Inhibition Test
IC50 412±n/a nM
Citation Kim, JHChough, CYJeong, HULee, SMJoung, MSKim, SJKim, TWLee, SIYi, EJKim, KALee, JMYu, SMJo, YSMoon, HSKim, KR Substituted N-(pyrrolidine-3-yl)-7H-pyrrolo[2,3-D]pyrimidine-4-amine as janus kinase inhibitor US Patent US10081635 Publication Date 9/25/2018
 
Tyrosine-protein kinase JAK1
Name:Tyrosine-protein kinase JAK1
Type:Protein
Mol. Mass.:133293.73
Organism:Homo sapiens (Human)
Description:P23458
Residue:1154
BDBM286095
NameBDBM286095
Synonyms:(R)-3-(7-(methyl(7H-pyrrolo[2,3-d]pyrimidin-4-yl)amino)-5-azaspiro[2.4]heptan-5-yl)-3-oxopropanenitrile | US10081635, Example 5
TypeSmall organic molecule
Emp. Form.C16H18N6O
Mol. Mass.310.3537
SMILESCN([C@H]1CN(CC11CC1)C(=O)CC#N)c1ncnc2[nH]ccc12