Reaction Details
TargetTyrosine-protein kinase JAK1
LigandBDBM286099
Substrate/Competitorn/a
Meas. Tech.In Vitro JAK Kinase Inhibition Test
IC50 422±n/a nM
Citation Kim, JHChough, CYJeong, HULee, SMJoung, MSKim, SJKim, TWLee, SIYi, EJKim, KALee, JMYu, SMJo, YSMoon, HSKim, KR Substituted N-(pyrrolidine-3-yl)-7H-pyrrolo[2,3-D]pyrimidine-4-amine as janus kinase inhibitor US Patent US10081635 Publication Date 9/25/2018
 
Tyrosine-protein kinase JAK1
Name:Tyrosine-protein kinase JAK1
Type:Protein
Mol. Mass.:133293.73
Organism:Homo sapiens (Human)
Description:P23458
Residue:1154
BDBM286099
NameBDBM286099
Synonyms:N-(5-(ethylsulfonyl)-5-azaspiro[2.4]heptan-7-yl)-N-methyl-7H-pyrrolo[2,3-d]pyrimidin-4-amine | US10081635, Example 62
TypeSmall organic molecule
Emp. Form.C15H21N5O2S
Mol. Mass.335.425
SMILESCCS(=O)(=O)N1CC(N(C)c2ncnc3[nH]ccc23)C2(CC2)C1