Reaction Details
TargetPeroxisome proliferator-activated receptor gamma
LigandBDBM147210
Substrate/Competitorn/a
Meas. Tech.Lanthascreen Competitive Binding Assay
IC50 0.9±n/a nM
Citation Kamenecka, TMGriffin, PRKoenig, MAsteian, ABlayo, AHe, YShin, Y N-biphenylmethylindole modulators of PPARG US Patent US8957093 Publication Date 2/17/2015
 
Peroxisome proliferator-activated receptor gamma
Name:Peroxisome proliferator-activated receptor gamma
Type:Nuclear Receptor
Mol. Mass.:57613.46
Organism:Homo sapiens (Human)
Description:P37231
Residue:505
BDBM147210
NameBDBM147210
Synonyms:US8957093, 19
TypeSmall organic molecule
Emp. Form.C34H32N2O4
Mol. Mass.532.6289
SMILESCOc1ccc(cc1)[C@H](C)NC(=O)c1ccc2n(Cc3ccc(cc3)-c3ccccc3C(O)=O)c(C)c(C)c2c1