Reaction Details
TargetPeroxisome proliferator-activated receptor gamma
LigandBDBM147263
Substrate/Competitorn/a
Meas. Tech.Lanthascreen Competitive Binding Assay
IC50 1±n/a nM
Citation Kamenecka, TMGriffin, PRKoenig, MAsteian, ABlayo, AHe, YShin, Y N-biphenylmethylindole modulators of PPARG US Patent US8957093 Publication Date 2/17/2015
 
Peroxisome proliferator-activated receptor gamma
Name:Peroxisome proliferator-activated receptor gamma
Type:Nuclear Receptor
Mol. Mass.:57613.46
Organism:Homo sapiens (Human)
Description:P37231
Residue:505
BDBM147263
NameBDBM147263
Synonyms:US8957093, 83
TypeSmall organic molecule
Emp. Form.C30H26N2O3S
Mol. Mass.494.604
SMILESCc1c(C)c2cc(ccc2n1Cc1ccc(cc1)-c1ccccc1C(O)=O)C(=O)NCc1cccs1