Reaction Details
TargetPeroxisome proliferator-activated receptor gamma
LigandBDBM147275
Substrate/Competitorn/a
Meas. Tech.Lanthascreen Competitive Binding Assay
IC50 0.1±n/a nM
Citation Kamenecka, TMGriffin, PRKoenig, MAsteian, ABlayo, AHe, YShin, Y N-biphenylmethylindole modulators of PPARG US Patent US8957093 Publication Date 2/17/2015
 
Peroxisome proliferator-activated receptor gamma
Name:Peroxisome proliferator-activated receptor gamma
Type:Nuclear Receptor
Mol. Mass.:57613.46
Organism:Homo sapiens (Human)
Description:P37231
Residue:505
BDBM147275
NameBDBM147275
Synonyms:US8957093, 97
TypeSmall organic molecule
Emp. Form.C34H32N2O3
Mol. Mass.516.6295
SMILESCC[C@@H](NC(=O)c1ccc2n(Cc3ccc(cc3)-c3ccccc3C(O)=O)c(C)c(C)c2c1)c1ccccc1