Reaction Details
TargetGlycogen synthase kinase-3 beta
LigandBDBM47167
Substrate/Competitorn/a
Meas. Tech.Kinase Assay
IC50>1000±n/a nM
Citation Dannhardt, GPlutizki, SGanser, CLauermann, E Conjugated 3-(indolyl)- and 3-(azaindolyl)-4-arylmaleimide compounds and their use in tumor treatment US Patent US8957103 Publication Date 2/17/2015
 
Glycogen synthase kinase-3 beta
Name:Glycogen synthase kinase-3 beta
Type:Enzyme
Mol. Mass.:46756.38
Organism:Homo sapiens (Human)
Description:P49841
Residue:420
BDBM47167
NameBDBM47167
Synonyms:CHEMBL201511 US9364459, A
Typen/a
Emp. Form.C21H18N2O5
Mol. Mass.378.378
SMILESCOc1cc(cc(OC)c1OC)C1=C(C(=O)NC1=O)c1c[nH]c2ccccc12