Reaction Details
TargetVascular endothelial growth factor receptor 2
LigandBDBM47163
Substrate/Competitorn/a
Meas. Tech.Kinase Assay
IC50>1000±n/a nM
Citation Dannhardt, GPlutizki, SGanser, CLauermann, E Conjugated 3-(indolyl)- and 3-(azaindolyl)-4-arylmaleimide compounds and their use in tumor treatment US Patent US8957103 Publication Date 2/17/2015
 
Vascular endothelial growth factor receptor 2
Name:Vascular endothelial growth factor receptor 2
Type:Receptor Tyrosine Kinase
Mol. Mass.:151510.97
Organism:Homo sapiens (Human)
Description:P35968
Residue:1356
BDBM47163
NameBDBM47163
Synonyms:US8957103, A
Typen/a
Emp. Form.C30H36N4O6
Mol. Mass.548.63
SMILESCOc1cc(cc(OC)c1OC)C1=C(C(=O)NC1=O)c1cn(CCCNC(=O)C(N)CC(C)C)c2ccccc12