Reaction Details
TargetGlycogen synthase kinase-3 beta
LigandBDBM147461
Substrate/Competitorn/a
Meas. Tech.Kinase Assay
IC50 134±n/a nM
Citation Dannhardt, GPlutizki, SGanser, CLauermann, E Conjugated 3-(indolyl)- and 3-(azaindolyl)-4-arylmaleimide compounds and their use in tumor treatment US Patent US8957103 Publication Date 2/17/2015
 
Glycogen synthase kinase-3 beta
Name:Glycogen synthase kinase-3 beta
Type:Enzyme
Mol. Mass.:46756.38
Organism:Homo sapiens (Human)
Description:P49841
Residue:420
BDBM147461
NameBDBM147461
Synonyms:US8957103, C
TypeSmall organic molecule
Emp. Form.C30H35N3O7
Mol. Mass.549.6148
SMILESCOc1cc(cc(OC)c1OC)C1=C(C(=O)NC1=O)c1cn(CCCOC(=O)C(N)CC(C)C)c2ccccc12