Reaction Details
Target5-hydroxytryptamine receptor 5A
LigandBDBM148155
Substrate/Competitorn/a
Meas. Tech.Binding Assay
pH7.4±n/a
Temperature310.15±n/a K
Ki 0.68±n/a nM
Commentsextracted
Citation Hamaguchi, WKinoyama, IKoganemaru, YMiyazaki, TKaneko, OSekioka, RWashio, T Tetrahydroisoquinoline derivative US Patent US8962612 Publication Date 2/24/2015
 
5-hydroxytryptamine receptor 5A
Name:5-hydroxytryptamine receptor 5A
Type:Enzyme
Mol. Mass.:40266.25
Organism:Homo sapiens (Human)
Description:P47898
Residue:357
BDBM148155
NameBDBM148155
Synonyms:US8962612, 26
TypeSmall organic molecule
Emp. Form.C17H14F4N4O
Mol. Mass.366.3129
SMILESNC(N)=NC(=O)N1CCc2c(F)ccc(c2C1)-c1c(F)cc(F)cc1F