Reaction Details
Target5-hydroxytryptamine receptor 5A
LigandBDBM148157
Substrate/Competitorn/a
Meas. Tech.Binding Assay
pH7.4±n/a
Temperature310.15±n/a K
Ki 2.7±n/a nM
Commentsextracted
Citation Hamaguchi, WKinoyama, IKoganemaru, YMiyazaki, TKaneko, OSekioka, RWashio, T Tetrahydroisoquinoline derivative US Patent US8962612 Publication Date 2/24/2015
 
5-hydroxytryptamine receptor 5A
Name:5-hydroxytryptamine receptor 5A
Type:Enzyme
Mol. Mass.:40266.25
Organism:Homo sapiens (Human)
Description:P47898
Residue:357
BDBM148157
NameBDBM148157
Synonyms:US8962612, 44
TypeSmall organic molecule
Emp. Form.C17H15ClF2N4O
Mol. Mass.364.777
SMILES[#7]\[#6](-[#7])=[#7]\[#6](=O)-[#7]-1-[#6]-[#6]-c2c(Cl)ccc(c2-[#6]-1)-c1ccc(F)cc1F