Reaction Details
Target5-hydroxytryptamine receptor 5A
LigandBDBM148158
Substrate/Competitorn/a
Meas. Tech.Binding Assay
pH7.4±n/a
Temperature310.15±n/a K
Ki 6.9±n/a nM
Commentsextracted
Citation Hamaguchi, WKinoyama, IKoganemaru, YMiyazaki, TKaneko, OSekioka, RWashio, T Tetrahydroisoquinoline derivative US Patent US8962612 Publication Date 2/24/2015
 
5-hydroxytryptamine receptor 5A
Name:5-hydroxytryptamine receptor 5A
Type:Enzyme
Mol. Mass.:40266.25
Organism:Homo sapiens (Human)
Description:P47898
Residue:357
BDBM148158
NameBDBM148158
Synonyms:US8962612, 46
TypeSmall organic molecule
Emp. Form.C16H14F3N5O
Mol. Mass.349.3105
SMILES[#7]\[#6](-[#7])=[#7]\[#6](=O)-[#7]-1-[#6]-[#6]-c2c(F)ccc(c2-[#6]-1)-c1ncc(F)cc1F