Reaction Details
Target5-hydroxytryptamine receptor 5A
LigandBDBM148167
Substrate/Competitorn/a
Meas. Tech.Binding Assay
pH7.4±n/a
Temperature310.15±n/a K
Ki 1.3±n/a nM
Commentsextracted
Citation Hamaguchi, WKinoyama, IKoganemaru, YMiyazaki, TKaneko, OSekioka, RWashio, T Tetrahydroisoquinoline derivative US Patent US8962612 Publication Date 2/24/2015
 
5-hydroxytryptamine receptor 5A
Name:5-hydroxytryptamine receptor 5A
Type:Enzyme
Mol. Mass.:40266.25
Organism:Homo sapiens (Human)
Description:P47898
Residue:357
BDBM148167
NameBDBM148167
Synonyms:US8962612, 78
TypeSmall organic molecule
Emp. Form.C19H16F4N4O
Mol. Mass.392.3502
SMILES[#7]\[#6](-[#7])=[#7]\[#6](=O)-[#7]-1-[#6]-c2c(ccc(F)c2C2([#6]-[#6]2)[#6]-1)-c1cc(F)c(F)cc1F