Reaction Details
TargetLymphokine-activated killer T-cell-originated protein kinase
LigandBDBM148993
Substrate/Competitorn/a
Meas. Tech.Kinase Assay
pH7.4±n/a
Temperature298.15±n/a K
IC50 0.38±n/a nM
Commentsextracted
Citation Nakamura, YMatsuo, YHisada, SAhmed, FHuntley, RSajjadi-Hashemi, ZJenkins, DMKargbo, RBCui, WGauuan, PJWalker, JRDecornez, HGurram, M Tricyclic compounds and PBK inhibitors containing the same US Patent US8962648 Publication Date 2/24/2015
 
Lymphokine-activated killer T-cell-originated protein kinase
Name:Lymphokine-activated killer T-cell-originated protein kinase
Type:n/a
Mol. Mass.:36072.55
Organism:Homo sapiens (Human)
Description:n/a
Residue:322
BDBM148993
NameBDBM148993
Synonyms:US8962648, 72 | US8962648, 73
TypeSmall organic molecule
Emp. Form.C18H14N2O2S
Mol. Mass.322.381
SMILESNCc1ccc(cc1)-c1c(O)ccc2[nH]c(=O)c3sccc3c12