Reaction Details
TargetLymphokine-activated killer T-cell-originated protein kinase
LigandBDBM149070
Substrate/Competitorn/a
Meas. Tech.Kinase Assay
pH7.4±n/a
Temperature298.15±n/a K
IC50 1.9±n/a nM
Commentsextracted
Citation Nakamura, YMatsuo, YHisada, SAhmed, FHuntley, RSajjadi-Hashemi, ZJenkins, DMKargbo, RBCui, WGauuan, PJWalker, JRDecornez, HGurram, M Tricyclic compounds and PBK inhibitors containing the same US Patent US8962648 Publication Date 2/24/2015
 
Lymphokine-activated killer T-cell-originated protein kinase
Name:Lymphokine-activated killer T-cell-originated protein kinase
Type:n/a
Mol. Mass.:36072.55
Organism:Homo sapiens (Human)
Description:n/a
Residue:322
BDBM149070
NameBDBM149070
Synonyms:US8962648, 348
TypeSmall organic molecule
Emp. Form.C21H18N2O2S
Mol. Mass.362.445
SMILESNCC1(CC1)c1ccc(cc1)-c1c(O)ccc2[nH]c(=O)c3sccc3c12