Reaction Details
TargetLymphokine-activated killer T-cell-originated protein kinase
LigandBDBM149072
Substrate/Competitorn/a
Meas. Tech.Kinase Assay
pH7.4±n/a
Temperature298.15±n/a K
IC50 2±n/a nM
Commentsextracted
Citation Nakamura, YMatsuo, YHisada, SAhmed, FHuntley, RSajjadi-Hashemi, ZJenkins, DMKargbo, RBCui, WGauuan, PJWalker, JRDecornez, HGurram, M Tricyclic compounds and PBK inhibitors containing the same US Patent US8962648 Publication Date 2/24/2015
 
Lymphokine-activated killer T-cell-originated protein kinase
Name:Lymphokine-activated killer T-cell-originated protein kinase
Type:n/a
Mol. Mass.:36072.55
Organism:Homo sapiens (Human)
Description:n/a
Residue:322
BDBM149072
NameBDBM149072
Synonyms:US8962648, 353
TypeSmall organic molecule
Emp. Form.C20H16N2O2S
Mol. Mass.348.418
SMILESOc1ccc2[nH]c(=O)c3sccc3c2c1-c1ccc2CCNCc2c1