Reaction Details
TargetcAMP and cAMP-inhibited cGMP 3',5'-cyclic phosphodiesterase 10A
LigandBDBM149480
Substrate/Competitorn/a
Meas. Tech.Fluorescence Polarization Assay
Ki 2.5±n/a nM
Citation Breslin, MJCox, CDHartingh, TJPero, JRaheem, ITRossi, MVassallo, L Aryloxmethyl cyclopropane derivatives as PDE10 inhibitors US Patent US8975261 Publication Date 3/10/2015
 
cAMP and cAMP-inhibited cGMP 3',5'-cyclic phosphodiesterase 10A
Name:cAMP and cAMP-inhibited cGMP 3',5'-cyclic phosphodiesterase 10A
Type:Protein
Mol. Mass.:88412.52
Organism:Homo sapiens (Human)
Description:Q9Y233
Residue:1055
BDBM149480
NameBDBM149480
Synonyms:US8975261, RR4
TypeSmall organic molecule
Emp. Form.C25H28N4O3
Mol. Mass.432.5148
SMILESCOc1ccc(nc1)[C@H]1C[C@@H]1COc1nc2cccnc2cc1C1CCCN(C1)C(C)=O