Reaction Details
TargetcAMP and cAMP-inhibited cGMP 3',5'-cyclic phosphodiesterase 10A
LigandBDBM149483
Substrate/Competitorn/a
Meas. Tech.Fluorescence Polarization Assay
Ki 0.8±n/a nM
Citation Breslin, MJCox, CDHartingh, TJPero, JRaheem, ITRossi, MVassallo, L Aryloxmethyl cyclopropane derivatives as PDE10 inhibitors US Patent US8975261 Publication Date 3/10/2015
 
cAMP and cAMP-inhibited cGMP 3',5'-cyclic phosphodiesterase 10A
Name:cAMP and cAMP-inhibited cGMP 3',5'-cyclic phosphodiesterase 10A
Type:Protein
Mol. Mass.:88412.52
Organism:Homo sapiens (Human)
Description:Q9Y233
Residue:1055
BDBM149483
NameBDBM149483
Synonyms:US8975261, I-73
TypeSmall organic molecule
Emp. Form.C21H22N4O2
Mol. Mass.362.425
SMILESCOc1ccc(nc1)[C@H]1C[C@@H]1COc1nc(C)ncc1-c1ccc(C)nc1