Reaction Details
TargetcAMP and cAMP-inhibited cGMP 3',5'-cyclic phosphodiesterase 10A
LigandBDBM149487
Substrate/Competitorn/a
Meas. Tech.Fluorescence Polarization Assay
Ki 0.15±n/a nM
Citation Breslin, MJCox, CDHartingh, TJPero, JRaheem, ITRossi, MVassallo, L Aryloxmethyl cyclopropane derivatives as PDE10 inhibitors US Patent US8975261 Publication Date 3/10/2015
 
cAMP and cAMP-inhibited cGMP 3',5'-cyclic phosphodiesterase 10A
Name:cAMP and cAMP-inhibited cGMP 3',5'-cyclic phosphodiesterase 10A
Type:Protein
Mol. Mass.:88412.52
Organism:Homo sapiens (Human)
Description:Q9Y233
Residue:779
BDBM149487
NameBDBM149487
Synonyms:US8975261, I-31
TypeSmall organic molecule
Emp. Form.C21H25N3O3
Mol. Mass.367.4415
SMILESCOc1ccc(nc1)[C@H]1C[C@@H]1COc1nc(C)ncc1C1=CCC(O)CC1