Reaction Details
TargetDual specificity protein kinase TTK
LigandBDBM149685
Substrate/Competitorn/a
Meas. Tech.Trans-Phosphorylation Assay
pH3±n/a
IC50 23±n/a nM
Commentsextracted
Citation Caldarelli, MAngiolini, MBeria, IBrasca, MGCasuscelli, FD'Alessio, RLombardi Borgia, A Tricyclic pyrrolo derivatives, process for their preparation and their use as kinase inhibitors US Patent US8975267 Publication Date 3/10/2015
 
Dual specificity protein kinase TTK
Name:Dual specificity protein kinase TTK
Type:Protein
Mol. Mass.:97086.79
Organism:Homo sapiens (Human)
Description:P33981
Residue:857
BDBM149685
NameBDBM149685
Synonyms:US8975267, 7
TypeSmall organic molecule
Emp. Form.C25H31N7O2
Mol. Mass.461.5593
SMILESCOc1cc(ccc1Nc1ncc2CCc3c(C(N)=O)c(C)n(C)c3-c2n1)N1CCN(C)CC1