Reaction Details
TargetSerine/threonine-protein kinase pim-1
LigandBDBM149692
Substrate/Competitorn/a
Meas. Tech.Trans-Phosphorylation Assay
pH3±n/a
IC50 0.8±n/a nM
Commentsextracted
Citation Caldarelli, MAngiolini, MBeria, IBrasca, MGCasuscelli, FD'Alessio, RLombardi Borgia, A Tricyclic pyrrolo derivatives, process for their preparation and their use as kinase inhibitors US Patent US8975267 Publication Date 3/10/2015
 
Serine/threonine-protein kinase pim-1
Name:Serine/threonine-protein kinase pim-1
Type:Protein
Mol. Mass.:35681.82
Organism:Homo sapiens (Human)
Description:P11309
Residue:313
BDBM149692
NameBDBM149692
Synonyms:US8975267, 34
TypeSmall organic molecule
Emp. Form.C18H21N5OS
Mol. Mass.355.457
SMILESCSc1ncc2ccc3c(cn([C@@H]4CC[C@H](N)CC4)c3c2n1)C(N)=O