Reaction Details
TargetNeuraminidase
LigandBDBM4940
Substrate/CompetitorBDBM4702
Meas. Tech.Neuraminidase Inhibition Assay
IC50 2±n/a nM
Citation Smith, PWSollis, SLHowes, PDCherry, PCStarkey, IDCobley, KNWeston, HScicinski, JMerritt, AWhittington, AWyatt, PTaylor, NGreen, DBethell, RMadar, SFenton, RJMorley, PJPateman, TBeresford, A Dihydropyrancarboxamides related to zanamivir: a new series of inhibitors of influenza virus sialidases. 1. Discovery, synthesis, biological activity, and structure-activity relationships of 4-guanidino- and 4-amino-4H-pyran-6-carboxamides. J Med Chem41:787-97 (1998) 
 
Neuraminidase
Name:Neuraminidase
Type:Enzyme
Mol. Mass.:52000.86
Organism:Influenza A virus (A/Singapore/1/57(H2N2))
Description:Q6XUE4
Residue:469
BDBM4940
BDBM4702
NameBDBM4940
Synonyms:(2R,3R,4S)-4-carbamimidamido-2-(dipropylcarbamoyl)-3-acetamido-3,4-dihydro-2H-pyran-6-carboxylic acid | carboxamide deriv. 5g
TypeSmall organic molecule
Emp. Form.C16H27N5O5
Mol. Mass.369.4161
SMILES[H][C@]1([#8]-[#6](=[#6]-[#6@H](\[#7]=[#6](/[#7])-[#7])-[#6@H]1-[#7]-[#6](-[#6])=O)-[#6](-[#8])=O)[#6](=O)-[#7](-[#6]-[#6]-[#6])-[#6]-[#6]-[#6]