Reaction Details
TargetSphingosine 1-phosphate receptor 2
LigandBDBM149710
Substrate/Competitorn/a
Meas. Tech.Fluorescence-Based Assay
pH7.2±n/a
Temperature310.15±n/a K
IC50 3.4±n/a nM
Commentsextracted
Citation Naganawa, AKusumi, KOtsuki, KSekiguchi, TKakuuchi, AShinozaki, KYamamoto, HNonaka, S Phenyl derivative US Patent US8975409 Publication Date 3/10/2015
 
Sphingosine 1-phosphate receptor 2
Name:Sphingosine 1-phosphate receptor 2
Type:G Protein-Coupled Receptor (GPCR)
Mol. Mass.:38883.16
Organism:Homo sapiens (Human)
Description:Membranes isolated from S1P2-transfected CHO cells were used in ligand binding assay.
Residue:353
BDBM149710
NameBDBM149710
Synonyms:US8975409, Example 38
TypeSmall organic molecule
Emp. Form.C33H37FN2O7
Mol. Mass.592.6545
SMILESCC(C)CC1(O)CCN(CC1)C(=O)Nc1cc(Oc2ccc(F)cc2)cc(c1)C(=O)Oc1ccc(cc1)C(C)(C)C(O)=O