Reaction Details
TargetSodium/glucose cotransporter 1
LigandBDBM20880
Substrate/Competitorn/a
Meas. Tech.Uptake Assay
pH7.4±n/a
IC50 803±n/a nM
Commentsextracted
Citation Xu, ZQian, S Aryl glycoside compound, preparation method and use thereof US Patent US8980829 Publication Date 3/17/2015
 
Sodium/glucose cotransporter 1
Name:Sodium/glucose cotransporter 1
Type:Protein
Mol. Mass.:73503.78
Organism:Homo sapiens (Human)
Description:P13866
Residue:664
BDBM20880
NameBDBM20880
Synonyms:(2S,3R,4R,5S,6R)-2-{4-chloro-3-[(4-ethoxyphenyl)methyl]phenyl}-6-(hydroxymethyl)oxane-3,4,5-triol C-aryl glucoside, 6 Dapagliflozin
TypeSmall organic molecule
Emp. Form.C21H25ClO6
Mol. Mass.408.873
SMILESCCOc1ccc(Cc2cc(ccc2Cl)[C@@H]2O[C@H](CO)[C@@H](O)[C@H](O)[C@H]2O)cc1