Reaction Details
TargetPhosphatidylinositol 4,5-bisphosphate 3-kinase catalytic subunit delta isoform
LigandBDBM150175
Substrate/Competitorn/a
Meas. Tech.Biochemical Assay
IC50 9±n/a nM
Citation Fowler, KWHuang, DKesicki, EAOoi, HCOliver, ARuan, FTreiberg, JPuri, KD 5-fluoro-3-phenyl-2[1-(9H-purin-6-ylamino)propyl]-3H-quinazolin-4-one and 6-fluoro-3-phenyl-2-[1-(9H-purin-6-ylamino)ethyl]-3H-quinazolin-4-one as inhibitors of human phosphatidylinositol 3-kinase delta US Patent US8980901 Publication Date 3/17/2015
 
Phosphatidylinositol 4,5-bisphosphate 3-kinase catalytic subunit delta isoform
Name:Phosphatidylinositol 4,5-bisphosphate 3-kinase catalytic subunit delta isoform
Type:Enzyme Subunit
Mol. Mass.:119489.41
Organism:Homo sapiens (Human)
Description:O00329
Residue:1044
BDBM150175
NameBDBM150175
Synonyms:US8980901, 107 | US9149477, Compound 107
TypeSmall organic molecule
Emp. Form.C22H18FN7O
Mol. Mass.415.423
SMILESCC[C@H](Nc1ncnc2[nH]cnc12)c1nc2cccc(F)c2c(=O)n1-c1ccccc1