Reaction Details
TargetCalmodulin-domain protein kinase 1
LigandBDBM50383379
Substrate/Competitorn/a
Meas. Tech.Luminescent Kinase Assay
IC50 3.00±n/a nM
Citation Fan, EVan Voorhis, WCZhang, ZHuang, WOjo, KK 5-aminopyrazole-4-carboxamide inhibitors of CDPK1 from T. gondii and C. parvum US Patent US9518026 Publication Date 12/13/2016
 
Calmodulin-domain protein kinase 1
Name:Calmodulin-domain protein kinase 1
Type:Enzyme Catalytic Domain
Mol. Mass.:57248.42
Organism:Toxoplasma gondii
Description:n/a
Residue:507
BDBM50383379
NameBDBM50383379
Synonyms:CHEMBL2030552 US9518026, Example 7 | US9956214, Compound 7
TypeSmall organic molecule
Emp. Form.C21H22N6
Mol. Mass.358.4396
SMILESNc1ncnc2n(CC3CCNCC3)nc(-c3ccc4ccccc4c3)c12