Reaction Details
TargetUncharacterized protein
LigandBDBM50383379
Substrate/Competitorn/a
Meas. Tech.Luminescent Kinase Assay
IC50 1.000±n/a nM
Citation Fan, EVan Voorhis, WCZhang, ZHuang, WOjo, KK 5-aminopyrazole-4-carboxamide inhibitors of CDPK1 from T. gondii and C. parvum US Patent US9518026 Publication Date 12/13/2016
 
Uncharacterized protein
Name:Uncharacterized protein
Synonyms:Calmodulin-domain protein kinase (CDPK1)
Type:Enzyme Catalytic Domain
Mol. Mass.:60946.72
Organism:Cryptosporidium parvum
Description:n/a
Residue:538
BDBM50383379
NameBDBM50383379
TypeSmall organic molecule
Emp. Form.C21H22N6
Mol. Mass.358.4396
SMILESNc1ncnc2n(CC3CCNCC3)nc(-c3ccc4ccccc4c3)c12