Reaction Details
TargetAndrogen receptor
LigandBDBM150275
Substrate/Competitorn/a
Meas. Tech.Binding Assay
IC50 630±n/a nM
Citation Klar, UKuhnke, JBohlmann, RHübner, JRing, SFrenzel, TMenges, FBorden, SMuhn, HPrelle, K 19-nor-steroid derivatives with a 15α,16α-methylene group and a saturated 17,17-spirolactone ring, use thereof, and medicaments containing said derivatives US Patent US8987239 Publication Date 3/24/2015
 
Androgen receptor
Name:Androgen receptor
Type:Receptor
Mol. Mass.:99185.27
Organism:Homo sapiens (Human)
Description:CHO cells were stably transfected with human AR gene.
Residue:920
BDBM150275
NameBDBM150275
Synonyms:US8987239, A | US9034856, A
TypeSmall organic molecule
Emp. Form.C24H30O3
Mol. Mass.366.4932
SMILESC[C@]12CC[C@H]3[C@@H]([C@H]4C[C@H]4C4=CC(=O)CC[C@]34C)[C@@H]1[C@@H]1C[C@@H]1[C@@]21CCC(=O)O1