Reaction Details
TargetPeptidoglycan-N-acetylglucosamine deacetylase
LigandBDBM150808
Substrate/Competitorn/a
Meas. Tech.Fluorescamine Assay
pH7±n/a
Temperature298.15±n/a K
Ki 5.80e+5± 4.0e+4 nM
Commentsextracted
Citation Ariyakumaran, RPokrovskaya, VLittle, DJHowell, PLNitz, M Direct Staudinger-Phosphonite Reaction Provides Methylphosphonamidates as Inhibitors of CE4 De-N-acetylases. Chembiochem16:1350-6 (2015) 
 
Peptidoglycan-N-acetylglucosamine deacetylase
Name:Peptidoglycan-N-acetylglucosamine deacetylase
Type:Protein
Mol. Mass.:52665.99
Organism:Streptococcus pneumoniae (Firmicutes)
Description:Q8DP63
Residue:463
BDBM150808
NameBDBM150808
Synonyms:Sodium N-methylphosphate-1-O-methyl-6-O-benzyl-beta-D-glucosamine (15d)
TypeSmall organic molecule
Emp. Form.C15H23NNaO7P
Mol. Mass.383.3092
SMILES[Na+].CO[C@@H]1OC(COCc2ccccc2)[C@@H](O)C(O)[C@@H]1NP(C)([O-])=O