Reaction Details
TargetC-X-C chemokine receptor type 2
LigandBDBM150812
Substrate/Competitorn/a
Meas. Tech.In Vitro Inhibition Assay
Temperature310.15±n/a K
IC50 22±n/a nM
Commentsextracted
Citation Maeda, DYZebala, JA Pyrimidinecarboxamides as CXCR2 modulators US Patent US8981106 Publication Date 3/17/2015
 
C-X-C chemokine receptor type 2
Name:C-X-C chemokine receptor type 2
Type:Protein
Mol. Mass.:40767.88
Organism:Homo sapiens (Human)
Description:P25025
Residue:360
BDBM150812
NameBDBM150812
Synonyms:US8981106, 2 (SX-576) | USRE47267, Compound 2
TypeSmall organic molecule
Emp. Form.C20H15BF4N2O4S
Mol. Mass.466.214
SMILESOB(O)c1ccc(OC(F)(F)F)cc1CSc1ccc(cn1)C(=O)Nc1ccc(F)cc1