Reaction Details
TargetC-X-C chemokine receptor type 2
LigandBDBM150814
Substrate/Competitorn/a
Meas. Tech.In Vitro Inhibition Assay
Temperature310.15±n/a K
IC50 79±n/a nM
Commentsextracted
Citation Maeda, DYZebala, JA Pyrimidinecarboxamides as CXCR2 modulators US Patent US8981106 Publication Date 3/17/2015
 
C-X-C chemokine receptor type 2
Name:C-X-C chemokine receptor type 2
Type:Protein
Mol. Mass.:40767.88
Organism:Homo sapiens (Human)
Description:P25025
Residue:360
BDBM150814
NameBDBM150814
Synonyms:US8981106, 4
TypeSmall organic molecule
Emp. Form.C20H18BFN2O4S
Mol. Mass.412.242
SMILESCOc1ccc(B(O)O)c(CSc2ccc(cn2)C(=O)Nc2ccc(F)cc2)c1