Reaction Details
TargetC-X-C chemokine receptor type 2
LigandBDBM150831
Substrate/Competitorn/a
Meas. Tech.In Vitro Inhibition Assay
Temperature310.15±n/a K
IC50 112±n/a nM
Commentsextracted
Citation Maeda, DYZebala, JA Pyrimidinecarboxamides as CXCR2 modulators US Patent US8981106 Publication Date 3/17/2015
 
C-X-C chemokine receptor type 2
Name:C-X-C chemokine receptor type 2
Type:Protein
Mol. Mass.:40767.88
Organism:Homo sapiens (Human)
Description:P25025
Residue:360
BDBM150831
NameBDBM150831
Synonyms:US8981106, 20
TypeSmall organic molecule
Emp. Form.C25H26BFN2O3S
Mol. Mass.464.36
SMILESCC1(C)OB(OC1(C)C)c1ccc(CSc2ccc(cn2)C(=O)Nc2ccc(F)cc2)cc1