Reaction Details
TargetC-X-C chemokine receptor type 2
LigandBDBM150905
Substrate/Competitorn/a
Meas. Tech.In Vitro Inhibition Assay
Temperature310.15±n/a K
IC50 16±n/a nM
Commentsextracted
Citation Maeda, DYZebala, JA Pyrimidinecarboxamides as CXCR2 modulators US Patent US8981106 Publication Date 3/17/2015
 
C-X-C chemokine receptor type 2
Name:C-X-C chemokine receptor type 2
Type:Protein
Mol. Mass.:40767.88
Organism:Homo sapiens (Human)
Description:P25025
Residue:360
BDBM150905
NameBDBM150905
Synonyms:US8981106, 94
TypeSmall organic molecule
Emp. Form.C20H13ClFN3O4S
Mol. Mass.445.851
SMILESFc1ccc(NC(=O)c2ccc(SCC(=O)c3ccc(Cl)c(c3)N(=O)=O)nc2)cc1