Reaction Details
TargetC-X-C chemokine receptor type 2
LigandBDBM150966
Substrate/Competitorn/a
Meas. Tech.In Vitro Inhibition Assay
Temperature310.15±n/a K
IC50 78±n/a nM
Commentsextracted
Citation Maeda, DYZebala, JA Pyrimidinecarboxamides as CXCR2 modulators US Patent US8981106 Publication Date 3/17/2015
 
C-X-C chemokine receptor type 2
Name:C-X-C chemokine receptor type 2
Type:Protein
Mol. Mass.:40767.88
Organism:Homo sapiens (Human)
Description:P25025
Residue:360
BDBM150966
NameBDBM150966
Synonyms:US8981106, 155 | USRE47267, Compound 155
TypeSmall organic molecule
Emp. Form.C25H21BFN3O3S
Mol. Mass.473.327
SMILESOB(O)c1ccccc1CSc1ccc(cn1)C(=O)N(Cc1ccccn1)c1ccc(F)cc1