Reaction Details
TargetProtein-tyrosine kinase 2-beta
LigandBDBM286311
Substrate/Competitorn/a
Meas. Tech.Inhibition Assay
pH7.4±n/a
Ki 3.67±n/a nM
Commentsextracted
Citation Li, HNukui, SScales, SATeng, MYin, C Substituted pyrrolo[3,4-c]pyrazoles as PKC kinase inhibitors US Patent US9518060 Publication Date 12/13/2016
 
Protein-tyrosine kinase 2-beta
Name:Protein-tyrosine kinase 2-beta
Type:Protein
Mol. Mass.:115868.80
Organism:Homo sapiens (Human)
Description:Q14289
Residue:1009
BDBM286311
NameBDBM286311
Synonyms:US11220518, Ex. No. I2 US9518060, Example I2
TypeSmall organic molecule
Emp. Form.C23H35FN8O
Mol. Mass.458.5754
SMILESCC(C)c1ncc(F)c(Nc2n[nH]c3c2CN(C(=O)N2CC(C)(C)N(C)C[C@@H]2C)C3(C)C)n1