Reaction Details
TargetProtein-tyrosine kinase 2-beta
LigandBDBM286377
Substrate/Competitorn/a
Meas. Tech.Inhibition Assay
pH7.4±n/a
Ki 1.71±n/a nM
Commentsextracted
Citation Li, HNukui, SScales, SATeng, MYin, C Substituted pyrrolo[3,4-c]pyrazoles as PKC kinase inhibitors US Patent US9518060 Publication Date 12/13/2016
 
Protein-tyrosine kinase 2-beta
Name:Protein-tyrosine kinase 2-beta
Type:Protein
Mol. Mass.:115868.80
Organism:Homo sapiens (Human)
Description:Q14289
Residue:1009
BDBM286377
NameBDBM286377
Synonyms:US11220518, Ex. No. L4 US9518060, Example L4
TypeSmall organic molecule
Emp. Form.C20H24F5N7O2
Mol. Mass.489.4423
SMILESCN1CCC(F)(CC1)C(=O)N1Cc2c(Nc3nc(OCC(F)(F)F)ncc3F)n[nH]c2C1(C)C