Reaction Details
TargetCytochrome P450 3A4
LigandBDBM151185
Substrate/Competitorn/a
Meas. Tech.Inhibition Assay
Temperature310.15±n/a K
IC50 160±n/a nM
Commentsextracted
Citation Desai, MCHui, HCLiu, HSun, JXu, L Inhibitors of cytochrome P450 US Patent US8987313 Publication Date 3/24/2015
 
Cytochrome P450 3A4
Name:Cytochrome P450 3A4
Type:Enzyme
Mol. Mass.:57349.57
Organism:Homo sapiens (Human)
Description:n/a
Residue:503
BDBM151185
NameBDBM151185
Synonyms:US8987313, 5
TypeSmall organic molecule
Emp. Form.C37H46N6O5S2
Mol. Mass.718.928
SMILESCC(C)c1nc(CN(C)C(=O)N2C[C@H](O)C[C@H]2C(=O)N[C@H](CC[C@H](Cc2ccccc2)NC(=O)OCc2cncs2)Cc2ccccc2)cs1