Reaction Details
TargetCytochrome P450 3A4
LigandBDBM151195
Substrate/Competitorn/a
Meas. Tech.Inhibition Assay
Temperature310.15±n/a K
IC50<100±n/a nM
Commentsextracted
Citation Desai, MCHui, HCLiu, HSun, JXu, L Inhibitors of cytochrome P450 US Patent US8987313 Publication Date 3/24/2015
 
Cytochrome P450 3A4
Name:Cytochrome P450 3A4
Type:Enzyme
Mol. Mass.:57349.57
Organism:Homo sapiens (Human)
Description:n/a
Residue:503
BDBM151195
NameBDBM151195
Synonyms:US8987313, 36
TypeSmall organic molecule
Emp. Form.C39H49N7O5S2
Mol. Mass.759.98
SMILESCC(C)c1nc(CN(C)C(=O)N2C[C@H](C[C@H]2C(=O)N[C@H](CC[C@H](Cc2ccccc2)NC(=O)OCc2cncs2)Cc2ccccc2)NC(C)=O)cs1