Reaction Details
TargetEndothelial lipase
LigandBDBM151381
Substrate/Competitorn/a
Meas. Tech.Biological Assay
pH8±n/a
Temperature298.15±n/a K
IC50 1.1±n/a nM
Commentsextracted
Citation Finlay, HJiang, JKim, SParkhurst, BQiao, JXWang, TCPi, ZTora, GOLloyd, JJohnson, JA Amide, urea or sulfone amide linked benzothiazole inhibitors of endothelial lipase US Patent US8987314 Publication Date 3/24/2015
 
Endothelial lipase
Name:Endothelial lipase
Type:Protein
Mol. Mass.:56805.62
Organism:Homo sapiens (Human)
Description:Q9Y5X9
Residue:500
BDBM151381
NameBDBM151381
Synonyms:US8987314, B186
TypeSmall organic molecule
Emp. Form.C21H26N4O7S3
Mol. Mass.542.649
SMILESCC(C)(O)Cn1cc(ccc1=O)-c1ccc2nc(sc2c1)C(C(=O)NCCS(N)(=O)=O)S(C)(=O)=O