Reaction Details
TargetEndothelial lipase
LigandBDBM151389
Substrate/Competitorn/a
Meas. Tech.Biological Assay
pH8±n/a
Temperature298.15±n/a K
IC50 1±n/a nM
Commentsextracted
Citation Finlay, HJiang, JKim, SParkhurst, BQiao, JXWang, TCPi, ZTora, GOLloyd, JJohnson, JA Amide, urea or sulfone amide linked benzothiazole inhibitors of endothelial lipase US Patent US8987314 Publication Date 3/24/2015
 
Endothelial lipase
Name:Endothelial lipase
Type:Protein
Mol. Mass.:56805.62
Organism:Homo sapiens (Human)
Description:Q9Y5X9
Residue:500
BDBM151389
NameBDBM151389
Synonyms:US8987314, B195
TypeSmall organic molecule
Emp. Form.C17H18N4O6S3
Mol. Mass.470.543
SMILESCS(=O)(=O)C(C(=O)NCCS(N)(=O)=O)c1nc2cc(ccc2s1)-c1ccc(O)nc1