Reaction Details
TargetEndothelial lipase
LigandBDBM151498
Substrate/Competitorn/a
Meas. Tech.Biological Assay
pH8±n/a
Temperature298.15±n/a K
IC50 0.5±n/a nM
Commentsextracted
Citation Finlay, HJiang, JKim, SParkhurst, BQiao, JXWang, TCPi, ZTora, GOLloyd, JJohnson, JA Amide, urea or sulfone amide linked benzothiazole inhibitors of endothelial lipase US Patent US8987314 Publication Date 3/24/2015
 
Endothelial lipase
Name:Endothelial lipase
Type:Protein
Mol. Mass.:56805.62
Organism:Homo sapiens (Human)
Description:Q9Y5X9
Residue:500
BDBM151498
NameBDBM151498
Synonyms:US8987314, B309
TypeSmall organic molecule
Emp. Form.C24H20F4N4O6S3
Mol. Mass.632.627
SMILESNS(=O)(=O)CCNC(=O)C(c1nc2cc(ccc2s1)-c1ccc(F)nc1)S(=O)(=O)Cc1ccc(OC(F)(F)F)cc1