Reaction Details
TargetEndothelial lipase
LigandBDBM151521
Substrate/Competitorn/a
Meas. Tech.Biological Assay
pH8±n/a
Temperature298.15±n/a K
IC50 1.5±n/a nM
Commentsextracted
Citation Finlay, HJiang, JKim, SParkhurst, BQiao, JXWang, TCPi, ZTora, GOLloyd, JJohnson, JA Amide, urea or sulfone amide linked benzothiazole inhibitors of endothelial lipase US Patent US8987314 Publication Date 3/24/2015
 
Endothelial lipase
Name:Endothelial lipase
Type:Protein
Mol. Mass.:56805.62
Organism:Homo sapiens (Human)
Description:Q9Y5X9
Residue:500
BDBM151521
NameBDBM151521
Synonyms:US8987314, B332
TypeSmall organic molecule
Emp. Form.C26H29F3N4O7S3
Mol. Mass.662.721
SMILESNS(=O)(=O)CCNC(=O)C(c1nc2ccc(cc2s1)-c1cccc(c1)C(=O)N1CCC(O)CC1)S(=O)(=O)CCC(F)(F)F