Reaction Details
TargetHepatic triacylglycerol lipase
LigandBDBM151284
Substrate/Competitorn/a
Meas. Tech.Biological Assay
pH8±n/a
Temperature298.15±n/a K
IC50<10±n/a nM
Commentsextracted
Citation Finlay, HJiang, JKim, SParkhurst, BQiao, JXWang, TCPi, ZTora, GOLloyd, JJohnson, JA Amide, urea or sulfone amide linked benzothiazole inhibitors of endothelial lipase US Patent US8987314 Publication Date 3/24/2015
 
Hepatic triacylglycerol lipase
Name:Hepatic triacylglycerol lipase
Type:Protein
Mol. Mass.:55938.55
Organism:Homo sapiens (Human)
Description:P11150
Residue:499
BDBM151284
NameBDBM151284
Synonyms:US8987314, B80
TypeSmall organic molecule
Emp. Form.C20H18FN5O4S2
Mol. Mass.475.516
SMILESCc1nnc(CNC(=O)C(c2nc3cc(C)c(cc3s2)-c2ccc(F)nc2)S(C)(=O)=O)o1