Reaction Details
TargetHepatic triacylglycerol lipase
LigandBDBM151291
Substrate/Competitorn/a
Meas. Tech.Biological Assay
pH8±n/a
Temperature298.15±n/a K
IC50 2.6±n/a nM
Commentsextracted
Citation Finlay, HJiang, JKim, SParkhurst, BQiao, JXWang, TCPi, ZTora, GOLloyd, JJohnson, JA Amide, urea or sulfone amide linked benzothiazole inhibitors of endothelial lipase US Patent US8987314 Publication Date 3/24/2015
 
Hepatic triacylglycerol lipase
Name:Hepatic triacylglycerol lipase
Type:Protein
Mol. Mass.:55938.55
Organism:Homo sapiens (Human)
Description:P11150
Residue:499
BDBM151291
NameBDBM151291
Synonyms:US8987314, B87
TypeSmall organic molecule
Emp. Form.C18H20N4O6S3
Mol. Mass.484.57
SMILESCOc1ccc(cn1)-c1ccc2sc(nc2c1)C(C(=O)NCCS(N)(=O)=O)S(C)(=O)=O