Reaction Details
TargetHepatic triacylglycerol lipase
LigandBDBM151421
Substrate/Competitorn/a
Meas. Tech.Biological Assay
pH8±n/a
Temperature298.15±n/a K
IC50 0.8±n/a nM
Commentsextracted
Citation Finlay, HJiang, JKim, SParkhurst, BQiao, JXWang, TCPi, ZTora, GOLloyd, JJohnson, JA Amide, urea or sulfone amide linked benzothiazole inhibitors of endothelial lipase US Patent US8987314 Publication Date 3/24/2015
 
Hepatic triacylglycerol lipase
Name:Hepatic triacylglycerol lipase
Type:Protein
Mol. Mass.:55938.55
Organism:Homo sapiens (Human)
Description:P11150
Residue:499
BDBM151421
NameBDBM151421
Synonyms:US8987314, B232
TypeSmall organic molecule
Emp. Form.C25H27N3O5S2
Mol. Mass.513.629
SMILESCOCCS(=O)(=O)C(C(=O)NCc1cc(no1)C(C)C)c1nc2ccc(cc2s1)-c1ccccc1