Reaction Details
TargetHepatic triacylglycerol lipase
LigandBDBM151496
Substrate/Competitorn/a
Meas. Tech.Biological Assay
pH8±n/a
Temperature298.15±n/a K
IC50 1.5±n/a nM
Commentsextracted
Citation Finlay, HJiang, JKim, SParkhurst, BQiao, JXWang, TCPi, ZTora, GOLloyd, JJohnson, JA Amide, urea or sulfone amide linked benzothiazole inhibitors of endothelial lipase US Patent US8987314 Publication Date 3/24/2015
 
Hepatic triacylglycerol lipase
Name:Hepatic triacylglycerol lipase
Type:Protein
Mol. Mass.:55938.55
Organism:Homo sapiens (Human)
Description:P11150
Residue:499
BDBM151496
NameBDBM151496
Synonyms:US8987314, B307
TypeSmall organic molecule
Emp. Form.C20H19F4N3O5S3
Mol. Mass.553.571
SMILESNS(=O)(=O)CCNC(=O)C(c1nc2ccc(cc2s1)-c1ccccc1F)S(=O)(=O)CCC(F)(F)F