Reaction Details
TargetMenin
LigandBDBM152232
Substrate/Competitorn/a
Meas. Tech.NMR Spectroscopy Assay
IC50 650±n/a nM
Citation Grembecka, JCierpicki, THess, J Compositions and methods for treatment of leukemia US Patent US8993552 Publication Date 3/31/2015
 
Menin
Name:Menin
Type:Protein
Mol. Mass.:68022.55
Organism:Homo sapiens (Human)
Description:O00255
Residue:610
BDBM152232
NameBDBM152232
Synonyms:US8993552, 67
TypeSmall organic molecule
Emp. Form.C18H25N5S2
Mol. Mass.375.555
SMILESCC(C)c1cc2c(ncnc2s1)N1CCN(CC1)C1=NCC(C)(C)S1