Reaction Details
TargetProteinase-activated receptor 4
LigandBDBM286387
Substrate/Competitorn/a
Meas. Tech.FLIPR Assay
Temperature298.15±n/a K
IC50 1.06±n/a nM
Commentsextracted
Citation Martel, ATremblay, FMarinier, APriestley, ESPosy, SLLawrence, RMMiller, MM Imidazothiadiazole and imidazopyridazine derivatives as protease activated receptor 4 (PAR4) inhibitors for treating platelet aggregation US Patent US9518064 Publication Date 12/13/2016
 
Proteinase-activated receptor 4
Name:Proteinase-activated receptor 4
Type:Protein
Mol. Mass.:41145.16
Organism:Homo sapiens (Human)
Description:Q96RI0
Residue:385
BDBM286387
NameBDBM286387
Synonyms:2-Methoxy-6-(6-methoxy-4-((3-(pyrimidin-5-yl)benzyl)oxy)benzofuran-2-yl)imidazo[2,1-b][1,3,4]thiadiazole | US9518064, Example 1
TypeSmall organic molecule
Emp. Form.C25H19N5O4S
Mol. Mass.485.514
SMILESCOc1nn2cc(nc2s1)-c1cc2c(OCc3cccc(c3)-c3cncnc3)cc(OC)cc2o1